Target
Carbonic anhydrase 7
Ligand
BDBM50131683
Substrate
Meas. Tech.
ChEMBL_1523556 (CHEMBL3631204)
Ki
630±n/a nM
Citation
 Maresca, AAkyuz, GOsman, SMAlOthman, ZSupuran, CT Inhibition of mammalian carbonic anhydrase isoforms I-XIV with a series of phenolic acid esters. Bioorg Med Chem 23:7181-8 (2015)  
Target
Name:
Carbonic anhydrase 7
Synonyms:
CA-VII CAH7_HUMAN Carbonic anhydrase Carbonic anhydrase VII (CA VII)
Type:
Enzyme
Mol. Mass.:
29664.11
Organism:
Homo sapiens (Human)
Description:
Human cloned isozyme.
Residue:
264
  
Inhibitor
Name:
BDBM50131683
Synonyms:
Benzyl (E)-Ferulate | Benzyl Ferulate
Type:
Small organic molecule
Emp. Form.:
C17H16O4
Mol. Mass.:
284.3065
SMILES:
COc1cc(\C=C\C(=O)OCc2ccccc2)ccc1O
: