Target
Probable G-protein coupled receptor 139
Ligand
BDBM50131905
Substrate
Meas. Tech.
ChEMBL_1526933 (CHEMBL3637279)
EC50
46±n/a nM
Citation
 Dvorak, CACoate, HNepomuceno, DWennerholm, MKuei, CLord, BWoody, DBonaventure, PLiu, CLovenberg, TCarruthers, NI Identification and SAR of Glycine Benzamides as Potent Agonists for the GPR139 Receptor. ACS Med Chem Lett 6:1015-8 (2015)  
Target
Name:
Probable G-protein coupled receptor 139
Synonyms:
G(q)-coupled orphan receptor GPRg1 G-protein-coupled receptor PGR3 GPR139 GPRG1 Probable G-protein coupled receptor 139
Type:
PROTEIN
Mol. Mass.:
40700.34
Organism:
Homo sapiens (Human)
Description:
ChEMBL_109920
Residue:
353
  
Inhibitor
Name:
BDBM50131905
Synonyms:
CHEMBL3633887
Type:
Small organic molecule
Emp. Form.:
C17H16Cl2N2O2
Mol. Mass.:
351.227
SMILES:
C[C@H](NC(=O)CNC(=O)c1cc(Cl)cc(Cl)c1)c1ccccc1
: