Target
Polyphenol oxidase 2
Ligand
BDBM50132147
Substrate
Meas. Tech.
ChEMBL_1527144 (CHEMBL3635454)
IC50
>200000±n/a nM
Citation
 Liu, JWu, FChen, C Design and synthesis of aloe-emodin derivatives as potent anti-tyrosinase, antibacterial and anti-inflammatory agents. Bioorg Med Chem Lett 25:5142-6 (2015)  
Target
Name:
Polyphenol oxidase 2
Synonyms:
Monophenol monooxygenase PPO2 Tyrosinase
Type:
Protein
Mol. Mass.:
63923.66
Organism:
Agaricus bisporus (Common mushroom)
Description:
O42713
Residue:
556
  
Inhibitor
Name:
BDBM50132147
Synonyms:
CHEMBL3633615
Type:
Small organic molecule
Emp. Form.:
C17H13NO5
Mol. Mass.:
311.2888
SMILES:
CCO\N=C\c1cc(O)c2C(=O)c3c(O)cccc3C(=O)c2c1
: