Target
Metabotropic glutamate receptor 5
Ligand
BDBM50132669
Substrate
Meas. Tech.
ChEMBL_1527423 (CHEMBL3636798)
EC50
1259±n/a nM
Citation
 Malosh, CTurlington, MBridges, TMRook, JMNoetzel, MJVinson, PNSteckler, TLavreysen, HMackie, CBartolomé-Nebreda, JMConde-Ceide, SMartínez-Viturro, CMPiedrafita, MSánchez-Casado, MRMacdonald, GJDaniels, JSJones, CKNiswender, CMConn, PJLindsley, CWStauffer, SR Acyl dihydropyrazolo[1,5-a]pyrimidinones as metabotropic glutamate receptor 5 positive allosteric modulators. Bioorg Med Chem Lett 25:5115-20 (2015)  
Target
Name:
Metabotropic glutamate receptor 5
Synonyms:
GPRC1E GRM5_HUMAN metabotropic glutamate 5 | metabotropic glutamate 5a
Type:
Enzyme
Mol. Mass.:
132484.72
Organism:
Homo sapiens (Human)
Description:
Residue:
1212
  
Inhibitor
Name:
BDBM50132669
Synonyms:
CHEMBL3633964
Type:
Small organic molecule
Emp. Form.:
C15H15F2N3O2
Mol. Mass.:
307.2953
SMILES:
CC(=O)N1CCCn2nc(COc3cc(F)cc(F)c3)cc12
: