Target
TGF-beta receptor type-1
Ligand
BDBM50015639
Substrate
Meas. Tech.
ChEMBL_1525276 (CHEMBL3635885)
IC50
2180±n/a nM
Citation
 Krishnaiah, MJin, CHSheen, YYKim, DK Synthesis and biological evaluation of 5-(fluoro-substituted-6-methylpyridin-2-yl)-4-([1,2,4]triazolo[1,5-a]pyridin-6-yl)imidazoles as inhibitors of transforming growth factor-ß type I receptor kinase. Bioorg Med Chem Lett 25:5228-31 (2015)  
Target
Name:
TGF-beta receptor type-1
Synonyms:
ALK-5 Activin A receptor type II-like protein kinase of 53kD SKR4 TGF-beta receptor type I TGFBR1 TGFR1_HUMAN Transforming growth factor-beta receptor type I
Type:
enzyme
Mol. Mass.:
55968.24
Organism:
Homo sapiens (Human)
Description:
P36897
Residue:
503
  
Inhibitor
Name:
BDBM50015639
Synonyms:
CHEMBL3260567 | USRE47141, Example 2
Type:
Small organic molecule
Emp. Form.:
C22H18FN7
Mol. Mass.:
399.4236
SMILES:
Cc1cccc(n1)-c1[nH]c(CNc2ccccc2F)nc1-c1ccc2ncnn2c1
: