Target
5-hydroxytryptamine receptor 2A
Ligand
BDBM50133203
Substrate
Meas. Tech.
ChEMBL_1525281 (CHEMBL3635890)
Ki
29±n/a nM
Citation
 Huang, LZhang, WZhang, XYin, LChen, BSong, J Synthesis and pharmacological evaluation of piperidine (piperazine)-substituted benzoxazole derivatives as multi-target antipsychotics. Bioorg Med Chem Lett 25:5299-305 (2015)  
Target
Name:
5-hydroxytryptamine receptor 2A
Synonyms:
5-HT-2A 5-HT2A 5-hydroxytryptamine receptor 2A (5HT2A) Htr2 Serotonin Receptor 2A
Type:
G Protein-Coupled Receptor (GPCR)
Mol. Mass.:
52852.05
Organism:
Rattus norvegicus (rat)
Description:
Rat cortex membranes 5-HT2A receptors.
Residue:
471
  
Inhibitor
Name:
BDBM50133203
Synonyms:
CHEMBL3634810
Type:
Small organic molecule
Emp. Form.:
C27H29N3O3
Mol. Mass.:
443.5375
SMILES:
COc1ccccc1N1CCN(CCCOc2ccc(cc2)-c2nc3ccccc3o2)CC1
: