Target
Kappa-type opioid receptor
Ligand
BDBM50012153
Substrate
Meas. Tech.
ChEMBL_1525468 (CHEMBL3636666)
Ki
95±n/a nM
Citation
 Joshi, AAMurray, TFAldrich, JV Structure-Activity Relationships of the Peptide Kappa Opioid Receptor Antagonist Zyklophin. J Med Chem 58:8783-95 (2015)  
Target
Name:
Kappa-type opioid receptor
Synonyms:
KOR-1 OPIATE Kappa Opioid receptor Ror-d
Type:
G Protein-Coupled Receptor (GPCR)
Mol. Mass.:
42692.90
Organism:
Rattus norvegicus (rat)
Description:
P34975
Residue:
380
  
Inhibitor
Name:
BDBM50012153
Synonyms:
zyklophin
Type:
Small organic molecule
Emp. Form.:
C65H96N20O13
Mol. Mass.:
1365.5839
SMILES:
[H][C@]1(NC(=O)[C@H](CCCNC(N)=N)NC(=O)[C@H](CC(=O)NC[C@H](NC1=O)C(=O)N[C@@H](CCCNC(N)=N)C(=O)N1CCC[C@H]1C(=O)N[C@@H](CCCCN)C(N)=O)NC(=O)[C@H](Cc1ccccc1)NC(=O)CNC(=O)CNC(=O)[C@H](Cc1ccc(O)cc1)NCc1ccccc1)[C@@H](C)CC
: