Target
Lethal factor
Ligand
BDBM50133324
Substrate
Meas. Tech.
ChEMBL_1525606 (CHEMBL3637359)
IC50
11000±n/a nM
Citation
 Kurbanov, EKChiu, TLSolberg, JFrancis, SMaize, KMFernandez, JJohnson, RLHawkinson, JEWalters, MAFinzel, BCAmin, EA Probing the S2' Subsite of the Anthrax Toxin Lethal Factor Using Novel N-Alkylated Hydroxamates. J Med Chem 58:8723-33 (2015)  
Target
Name:
Lethal factor
Synonyms:
Anthrax Lethal Factor (LF) Antrax lethal toxin lef | lethal factor
Type:
PROTEIN
Mol. Mass.:
93758.56
Organism:
Bacillus anthracis
Description:
ChEMBL_1460338
Residue:
809
  
Inhibitor
Name:
BDBM50133324
Synonyms:
CHEMBL3634957
Type:
Small organic molecule
Emp. Form.:
C17H18F2N2O4S
Mol. Mass.:
384.398
SMILES:
C[C@@H](N(Cc1ccc(F)cc1)S(=O)(=O)c1ccc(F)c(C)c1)C(=O)NO
: