Target
Lethal factor
Ligand
BDBM50133303
Substrate
Meas. Tech.
ChEMBL_1525607 (CHEMBL3637360)
IC50
117000±n/a nM
Citation
 Kurbanov, EKChiu, TLSolberg, JFrancis, SMaize, KMFernandez, JJohnson, RLHawkinson, JEWalters, MAFinzel, BCAmin, EA Probing the S2' Subsite of the Anthrax Toxin Lethal Factor Using Novel N-Alkylated Hydroxamates. J Med Chem 58:8723-33 (2015)  
Target
Name:
Lethal factor
Synonyms:
Anthrax Lethal Factor (LF) Antrax lethal toxin lef | lethal factor
Type:
PROTEIN
Mol. Mass.:
93758.56
Organism:
Bacillus anthracis
Description:
ChEMBL_1460338
Residue:
809
  
Inhibitor
Name:
BDBM50133303
Synonyms:
CHEMBL3634978
Type:
Small organic molecule
Emp. Form.:
C15H22FN3O5S
Mol. Mass.:
375.416
SMILES:
C[C@@H](N(CCCNC(C)=O)S(=O)(=O)c1ccc(F)c(C)c1)C(=O)NO
: