Target
Mucosa-associated lymphoid tissue lymphoma translocation protein 1
Ligand
BDBM81348
Substrate
Meas. Tech.
ChEMBL_1525779 (CHEMBL3635348)
IC50
1900±n/a nM
Citation
 Lim, SMJeong, YLee, SIm, HTae, HSKim, BGPark, HDPark, JHong, S Identification of฿-Lapachone Analogs as Novel MALT1 Inhibitors To Treat an Aggressive Subtype of Diffuse Large B-Cell Lymphoma. J Med Chem 58:8491-502 (2015)  
Target
Name:
Mucosa-associated lymphoid tissue lymphoma translocation protein 1
Synonyms:
MALT lymphoma-associated translocation MALT1 MLT Paracaspase
Type:
Enzyme
Mol. Mass.:
92257.81
Organism:
Homo sapiens (Human)
Description:
Q9UDY8
Residue:
824
  
Inhibitor
Name:
BDBM81348
Synonyms:
β-Lapachone (A3) R115 (Reactive Blue 2) | beta-Lapachone
Type:
Small organic molecule
Emp. Form.:
C15H14O3
Mol. Mass.:
242.2699
SMILES:
CC1(C)CCC2=C(O1)c1ccccc1C(=O)C2=O
: