Target
Prolyl endopeptidase FAP
Ligand
BDBM50134186
Substrate
Meas. Tech.
ChEMBL_1537821 (CHEMBL3737792)
IC50
22000±n/a nM
Citation
 Chen, PFeng, DQian, XApgar, JWilkening, RKuethe, JTGao, YDScapin, GCox, JDoss, GEiermann, GHe, HLi, XLyons, KAMetzger, JPetrov, AWu, JKXu, SWeber, AEYan, YRoy, RSBiftu, T Structure-activity-relationship of amide and sulfonamide analogs of omarigliptin. Bioorg Med Chem Lett 25:5767-71 (2015)  
Target
Name:
Prolyl endopeptidase FAP
Synonyms:
APCE Dipeptidyl peptidase FAP FAPalpha Gelatine degradation protease FAP Post-proline cleaving enzyme SEPR_BOVIN Seprase Surface-expressed protease ZIP
Type:
PROTEIN
Mol. Mass.:
87742.67
Organism:
Bos taurus
Description:
ChEMBL_116681
Residue:
760
  
Inhibitor
Name:
BDBM50134186
Synonyms:
CHEMBL3734964
Type:
Small organic molecule
Emp. Form.:
C20H23F2N5O2
Mol. Mass.:
403.4257
SMILES:
N[C@H]1C[C@H](CO[C@@H]1c1cc(F)ccc1F)N1Cc2[nH]nc(NC(=O)C3CC3)c2C1
: