Target
Prolyl endopeptidase FAP
Ligand
BDBM50135009
Substrate
Meas. Tech.
ChEMBL_1537821 (CHEMBL3737792)
IC50
95000±n/a nM
Citation
 Chen, PFeng, DQian, XApgar, JWilkening, RKuethe, JTGao, YDScapin, GCox, JDoss, GEiermann, GHe, HLi, XLyons, KAMetzger, JPetrov, AWu, JKXu, SWeber, AEYan, YRoy, RSBiftu, T Structure-activity-relationship of amide and sulfonamide analogs of omarigliptin. Bioorg Med Chem Lett 25:5767-71 (2015)  
Target
Name:
Prolyl endopeptidase FAP
Synonyms:
APCE Dipeptidyl peptidase FAP FAPalpha Gelatine degradation protease FAP Post-proline cleaving enzyme SEPR_BOVIN Seprase Surface-expressed protease ZIP
Type:
PROTEIN
Mol. Mass.:
87742.67
Organism:
Bos taurus
Description:
ChEMBL_116681
Residue:
760
  
Inhibitor
Name:
BDBM50135009
Synonyms:
CHEMBL3736423
Type:
Small organic molecule
Emp. Form.:
C20H22F2N6O3S
Mol. Mass.:
464.489
SMILES:
Cn1cnc(c1)S(=O)(=O)n1cc2CN(Cc2n1)[C@H]1CO[C@@H]([C@@H](N)C1)c1cc(F)ccc1F
: