Target
5-hydroxytryptamine receptor 2A
Ligand
BDBM50134678
Substrate
Meas. Tech.
ChEMBL_1545083 (CHEMBL3750143)
Ki
69±n/a nM
Citation
 Canale, VKurczab, RPartyka, ASatala, GSloczynska, KKos, TJastrzebska-Wiesek, MSiwek, APekala, EBojarski, AJWesolowska, APopik, PZajdel, P N-Alkylated arylsulfonamides of (aryloxy)ethyl piperidines: 5-HT(7) receptor selectivity versus multireceptor profile. Bioorg Med Chem 24:130-9 (2016)  
Target
Name:
5-hydroxytryptamine receptor 2A
Synonyms:
5-HT-2 5-HT2A 5-hydroxytryptamine receptor 2A (5HT-2A) 5HT2A_HUMAN HTR2A | Serotonin receptor 2A
Type:
undefined
Mol. Mass.:
52607.65
Organism:
Homo sapiens (Human)
Description:
P28223
Residue:
471
  
Inhibitor
Name:
BDBM50134678
Synonyms:
CHEMBL3745815
Type:
Small organic molecule
Emp. Form.:
C26H29FN2O3S
Mol. Mass.:
468.583
SMILES:
CN(C1CCN(CCOc2ccccc2-c2ccccc2)CC1)S(=O)(=O)c1ccc(F)cc1
: