Target
D(2) dopamine receptor
Ligand
BDBM50134678
Substrate
Meas. Tech.
ChEMBL_1545084 (CHEMBL3750144)
Ki
54±n/a nM
Citation
 Canale, VKurczab, RPartyka, ASatala, GSloczynska, KKos, TJastrzebska-Wiesek, MSiwek, APekala, EBojarski, AJWesolowska, APopik, PZajdel, P N-Alkylated arylsulfonamides of (aryloxy)ethyl piperidines: 5-HT(7) receptor selectivity versus multireceptor profile. Bioorg Med Chem 24:130-9 (2016)  
Target
Name:
D(2) dopamine receptor
Synonyms:
D(2) dopamine receptor DOPAMINE D2 Long DRD2 Dopamine D2 receptor Dopamine D2 receptor (D2R) Dopamine2-like | d2
Type:
Cell-surface receptors
Mol. Mass.:
50647.10
Organism:
Homo sapiens (Human)
Description:
P14416
Residue:
443
  
Inhibitor
Name:
BDBM50134678
Synonyms:
CHEMBL3745815
Type:
Small organic molecule
Emp. Form.:
C26H29FN2O3S
Mol. Mass.:
468.583
SMILES:
CN(C1CCN(CCOc2ccccc2-c2ccccc2)CC1)S(=O)(=O)c1ccc(F)cc1
: