Target
5-hydroxytryptamine receptor 7
Ligand
BDBM50134688
Substrate
Meas. Tech.
ChEMBL_1545081 (CHEMBL3750141)
Ki
18±n/a nM
Citation
 Canale, VKurczab, RPartyka, ASatala, GSloczynska, KKos, TJastrzebska-Wiesek, MSiwek, APekala, EBojarski, AJWesolowska, APopik, PZajdel, P N-Alkylated arylsulfonamides of (aryloxy)ethyl piperidines: 5-HT(7) receptor selectivity versus multireceptor profile. Bioorg Med Chem 24:130-9 (2016)  
Target
Name:
5-hydroxytryptamine receptor 7
Synonyms:
5-HT-7 5-HT7 5-HT7S 5HT7 HTR7 | Serotonin receptor 7
Type:
G Protein-Coupled Receptor (GPCR)
Mol. Mass.:
53573.08
Organism:
Homo sapiens (Human)
Description:
P34969
Residue:
479
  
Inhibitor
Name:
BDBM50134688
Synonyms:
CHEMBL3747114
Type:
Small organic molecule
Emp. Form.:
C23H31FN2O3S
Mol. Mass.:
434.567
SMILES:
CC(C)c1ccccc1OCCN1CCC(CC1)N(C)S(=O)(=O)c1cccc(F)c1
: