Target
Polyphenol oxidase 2
Ligand
BDBM50031467
Substrate
Meas. Tech.
ChEMBL_1543862 (CHEMBL3749752)
IC50
26500±n/a nM
Citation
 Tan, XSong, YHPark, CLee, KWKim, JYKim, DWKim, KDLee, KWCurtis-Long, MJPark, KH Highly potent tyrosinase inhibitor, neorauflavane from Campylotropis hirtella and inhibitory mechanism with molecular docking. Bioorg Med Chem 24:153-9 (2016)  
Target
Name:
Polyphenol oxidase 2
Synonyms:
Monophenol monooxygenase PPO2 Tyrosinase
Type:
Protein
Mol. Mass.:
63923.66
Organism:
Agaricus bisporus (Common mushroom)
Description:
O42713
Residue:
556
  
Inhibitor
Name:
BDBM50031467
Synonyms:
5-HYDROXY-2-(HYDROXYMETHYL)-4H-PYRAN-4-ONE CHEMBL287556 US10857082, Kojic acid US9682910, kojic acid
Type:
Small organic molecule
Emp. Form.:
C6H6O4
Mol. Mass.:
142.1094
SMILES:
OCc1cc(=O)c(O)co1
: