Target
Mitogen-activated protein kinase kinase kinase kinase 4
Ligand
BDBM50134772
Substrate
Meas. Tech.
ChEMBL_1549420 (CHEMBL3755427)
IC50
470±n/a nM
Citation
 Ammirati, MBagley, SWBhattacharya, SKBuckbinder, LCarlo, AAConrad, RCortes, CDow, RLDowling, MSEl-Kattan, AFord, KGuimarães, CRHepworth, DJiao, WLaPerle, JLiu, SLondregan, ALoria, PMMathiowetz, AMMunchhof, MOrr, STPetersen, DNPrice, DASkoura, ASmith, ACWang, J Discovery of an in Vivo Tool to Establish Proof-of-Concept for MAP4K4-Based Antidiabetic Treatment. ACS Med Chem Lett 6:1128-33 (2015)  
Target
Name:
Mitogen-activated protein kinase kinase kinase kinase 4
Synonyms:
HGK KIAA0687 MAP4K4 MAPK/ERK kinase kinase kinase 4 MEKKK 4 NIK | Nck-interacting kinase
Type:
Serine/threonine-protein kinase
Mol. Mass.:
142114.73
Organism:
Homo sapiens (Human)
Description:
O95819
Residue:
1239
  
Inhibitor
Name:
BDBM50134772
Synonyms:
CHEMBL3754123
Type:
Small organic molecule
Emp. Form.:
C15H12ClN5
Mol. Mass.:
297.742
SMILES:
Nc1ncc(cn1)-c1cnc(N)c(c1)-c1ccc(Cl)cc1
: