Target
Mitogen-activated protein kinase kinase kinase kinase 4
Ligand
BDBM50138159
Substrate
Meas. Tech.
ChEMBL_1549419 (CHEMBL3755426)
IC50
1722±n/a nM
Citation
 Ammirati, MBagley, SWBhattacharya, SKBuckbinder, LCarlo, AAConrad, RCortes, CDow, RLDowling, MSEl-Kattan, AFord, KGuimarães, CRHepworth, DJiao, WLaPerle, JLiu, SLondregan, ALoria, PMMathiowetz, AMMunchhof, MOrr, STPetersen, DNPrice, DASkoura, ASmith, ACWang, J Discovery of an in Vivo Tool to Establish Proof-of-Concept for MAP4K4-Based Antidiabetic Treatment. ACS Med Chem Lett 6:1128-33 (2015)  
Target
Name:
Mitogen-activated protein kinase kinase kinase kinase 4
Synonyms:
HGK KIAA0687 MAP4K4 MAPK/ERK kinase kinase kinase 4 MEKKK 4 NIK | Nck-interacting kinase
Type:
Serine/threonine-protein kinase
Mol. Mass.:
142114.73
Organism:
Homo sapiens (Human)
Description:
O95819
Residue:
1239
  
Inhibitor
Name:
BDBM50138159
Synonyms:
CHEMBL3752670
Type:
Small organic molecule
Emp. Form.:
C18H13ClN2O
Mol. Mass.:
308.762
SMILES:
NC(=O)c1ccc(cc1)-c1cc(ccn1)-c1ccc(Cl)cc1
: