Target
Tyrosine-protein kinase JAK1
Ligand
BDBM50135129
Substrate
Meas. Tech.
ChEMBL_1545251 (CHEMBL3751001)
IC50
173±n/a nM
Citation
 Vasbinder, MMAlimzhanov, MAugustin, MBebernitz, GBell, KChuaqui, CDeegan, TFerguson, ADGoodwin, KHuszar, DKawatkar, AKawatkar, SRead, JShi, JSteinbacher, SSteuber, HSu, QToader, DWang, HWoessner, RWu, AYe, MZinda, M Identification of azabenzimidazoles as potent JAK1 selective inhibitors. Bioorg Med Chem Lett 26:60-7 (2015)  
Target
Name:
Tyrosine-protein kinase JAK1
Synonyms:
JAK-1 JAK1A JAK1_HUMAN Janus kinase 1 (JAK1) | Janus kinase 1 JAK1
Type:
Protein
Mol. Mass.:
133293.73
Organism:
Homo sapiens (Human)
Description:
P23458
Residue:
1154
  
Inhibitor
Name:
BDBM50135129
Synonyms:
CHEMBL3747077
Type:
Small organic molecule
Emp. Form.:
C19H20ClF2N5O
Mol. Mass.:
407.845
SMILES:
COc1cc(F)c(cc1F)-c1nc2c(NCC3CCNCC3)c(Cl)cnc2[nH]1
: