Target
Vitamin D3 receptor
Ligand
BDBM50200182
Substrate
Meas. Tech.
ChEMBL_1545479 (CHEMBL3748723)
Ki
0.040000±n/a nM
Citation
 Flores, AMassarelli, IThoden, JBPlum, LADeLuca, HF A Methylene Group on C-2 of 24,24-Difluoro-19-nor-1a,25-dihydroxyvitamin D3 Markedly Increases Bone Calcium Mobilization in Vivo. J Med Chem 58:9731-41 (2015)  
Target
Name:
Vitamin D3 receptor
Synonyms:
Nr1i1 Vdr | Vitamin D receptor
Type:
PROTEIN
Mol. Mass.:
47811.07
Organism:
Rattus norvegicus
Description:
ChEMBL_1505946
Residue:
423
  
Inhibitor
Name:
BDBM50200182
Synonyms:
(1S,3R,5Z,7E)-9,10-secocholesta-5,7,10(19)-triene-1,3,25-triol (1alpha,3beta,5Z,7E)-9,10-secocholesta-5,7,10(19)-triene-1,3,25-triol 1,25-DHCC 1alpha,25-dihydroxycholecalciferol CALCITRIOL | CHEMBL846
Type:
Small organic molecule
Emp. Form.:
C27H44O3
Mol. Mass.:
416.6365
SMILES:
C[C@H](CCCC(C)(C)O)[C@H]1CC[C@H]2\C(CCC[C@]12C)=C\C=C1\C[C@@H](O)C[C@H](O)C1=C
: