Target
Mu-type opioid receptor
Ligand
BDBM50135219
Substrate
Meas. Tech.
ChEMBL_1546048 (CHEMBL3748891)
Ki
2042±n/a nM
Citation
 Schembri, LSStoddart, LABriddon, SJKellam, BCanals, MGraham, BScammells, PJ Synthesis, Biological Evaluation, and Utility of Fluorescent Ligands Targeting theľ-Opioid Receptor. J Med Chem 58:9754-67 (2015)  
Target
Name:
Mu-type opioid receptor
Synonyms:
M-OR-1 MOR-1 MUOR1 Mu opiate receptor OPRM1 hMOP | mu-type opioid receptor isoform MOR-1
Type:
G Protein-Coupled Receptor (GPCR)
Mol. Mass.:
44789.51
Organism:
Homo sapiens (Human)
Description:
P35372
Residue:
400
  
Inhibitor
Name:
BDBM50135219
Synonyms:
CHEMBL3746843
Type:
Small organic molecule
Emp. Form.:
C28H37Cl2N3O5
Mol. Mass.:
566.516
SMILES:
Cl.Cl.[H][C@@]12Oc3c4c(C[C@@]5([H])N(C)CC[C@@]14[C@@]51C=C[C@@]2(OC)[C@@]2([H])C(=O)N(CCCCCCN)C(=O)[C@@]12[H])ccc3O
: