Target
Aromatase
Ligand
BDBM50135921
Substrate
Meas. Tech.
ChEMBL_1547124 (CHEMBL3755859)
Ki
2.5±n/a nM
Citation
 Yadav, MRBarmade, MATamboli, RSMurumkar, PR Developing steroidal aromatase inhibitors-an effective armament to win the battle against breast cancer. Eur J Med Chem 105:1-38 (2015)  
Target
Name:
Aromatase
Synonyms:
ARO1 CP19A_HUMAN CYP19 CYPXIX Cytochrome P450 19A1 Cytochrome P450-C19 (CYP19) FL cytokine receptor precursor | P-450AROM
Type:
Enzyme
Mol. Mass.:
57888.92
Organism:
Homo sapiens (Human)
Description:
P11511
Residue:
503
  
Inhibitor
Name:
BDBM50135921
Synonyms:
CHEMBL3752011
Type:
Small organic molecule
Emp. Form.:
C23H30O2
Mol. Mass.:
338.4831
SMILES:
[H][C@@]12CCC(=O)[C@@]1(C)CC[C@@]1([H])[C@@]2([H])C=C(CCCC)C2=CC(=O)C=C[C@]12C
: