Target
Aromatase
Ligand
BDBM50135998
Substrate
Meas. Tech.
ChEMBL_1547299 (CHEMBL3756935)
Ki
1.4±n/a nM
Citation
 Yadav, MRBarmade, MATamboli, RSMurumkar, PR Developing steroidal aromatase inhibitors-an effective armament to win the battle against breast cancer. Eur J Med Chem 105:1-38 (2015)  
Target
Name:
Aromatase
Synonyms:
ARO1 CP19A_HUMAN CYP19 CYPXIX Cytochrome P450 19A1 Cytochrome P450-C19 (CYP19) FL cytokine receptor precursor | P-450AROM
Type:
Enzyme
Mol. Mass.:
57888.92
Organism:
Homo sapiens (Human)
Description:
P11511
Residue:
503
  
Inhibitor
Name:
BDBM50135998
Synonyms:
CHEMBL3752668
Type:
Small organic molecule
Emp. Form.:
C23H34O2
Mol. Mass.:
342.5149
SMILES:
[H][C@@]12CCC(=O)[C@@]1(C)CC[C@@]1([H])[C@@]2([H])C[C@H](CCCC)C2=CC(=O)CC[C@]12C
: