Target
Aromatase
Ligand
BDBM50136076
Substrate
Meas. Tech.
ChEMBL_1547308 (CHEMBL3756944)
Ki
3.4±n/a nM
Citation
 Yadav, MRBarmade, MATamboli, RSMurumkar, PR Developing steroidal aromatase inhibitors-an effective armament to win the battle against breast cancer. Eur J Med Chem 105:1-38 (2015)  
Target
Name:
Aromatase
Synonyms:
ARO1 CP19A_HUMAN CYP19 CYPXIX Cytochrome P450 19A1 Cytochrome P450-C19 (CYP19) FL cytokine receptor precursor | P-450AROM
Type:
Enzyme
Mol. Mass.:
57888.92
Organism:
Homo sapiens (Human)
Description:
P11511
Residue:
503
  
Inhibitor
Name:
BDBM50136076
Synonyms:
CHEMBL3752403
Type:
Small organic molecule
Emp. Form.:
C20H29NO2
Mol. Mass.:
315.4498
SMILES:
[H][C@@]1(CN1)[C@]12CCC(=O)C=C1CC[C@@]1([H])[C@]3([H])CC[C@H](O)[C@@]3(C)CC[C@]21[H]
: