Target
Sphingosine 1-phosphate receptor 1
Ligand
BDBM50136345
Substrate
Meas. Tech.
ChEMBL_1548095 (CHEMBL3757927)
EC50
20±n/a nM
Citation
 Horan, JCKuzmich, DLiu, PDiSalvo, DLord, JMao, CHopkins, TDYu, HHarcken, CBetageri, RHill-Drzewi, MPatenaude, LPatel, MFletcher, KTerenzzio, DLinehan, BXia, HPatel, MStudwell, DMiller, CHickey, ELevin, JISmith, DKemper, RAModis, LKBannen, LCChan, DSMac, MBNg, SWang, YXu, WLemieux, RM Late-stage optimization of a tercyclic class of S1P3-sparing, S1P1 receptor agonists. Bioorg Med Chem Lett 26:466-71 (2016)  
Target
Name:
Sphingosine 1-phosphate receptor 1
Synonyms:
CHEDG1 Endothelial differentiation G-protein coupled receptor 1 S1P1 S1PR1_HUMAN Sphingosine 1-phosphate receptor Edg-1
Type:
Enzyme
Mol. Mass.:
42836.02
Organism:
Homo sapiens (Human)
Description:
P21453
Residue:
382
  
Inhibitor
Name:
BDBM50136345
Synonyms:
CHEMBL3753448
Type:
Small organic molecule
Emp. Form.:
C21H24ClFN4O3
Mol. Mass.:
434.892
SMILES:
CC(C)Cc1cc(cc(C)n1)-c1nc(no1)-c1cc(F)c(OC[C@H](N)CO)cc1Cl
: