Target
Sphingosine 1-phosphate receptor 3
Ligand
BDBM50136554
Substrate
Meas. Tech.
ChEMBL_1548096 (CHEMBL3757928)
EC50
>10000±n/a nM
Citation
 Horan, JCKuzmich, DLiu, PDiSalvo, DLord, JMao, CHopkins, TDYu, HHarcken, CBetageri, RHill-Drzewi, MPatenaude, LPatel, MFletcher, KTerenzzio, DLinehan, BXia, HPatel, MStudwell, DMiller, CHickey, ELevin, JISmith, DKemper, RAModis, LKBannen, LCChan, DSMac, MBNg, SWang, YXu, WLemieux, RM Late-stage optimization of a tercyclic class of S1P3-sparing, S1P1 receptor agonists. Bioorg Med Chem Lett 26:466-71 (2016)  
Target
Name:
Sphingosine 1-phosphate receptor 3
Synonyms:
C9orf108 EDG3 S1P receptor 3 S1P3 S1PR3_HUMAN Sphingosine 1-phosphate receptor 3 (S1P3) | Sphingosine 1-phosphate receptor Edg-3
Type:
G Protein-Coupled Receptor (GPCR)
Mol. Mass.:
42278.13
Organism:
Homo sapiens (Human)
Description:
Q99500
Residue:
378
  
Inhibitor
Name:
BDBM50136554
Synonyms:
CHEMBL3752660
Type:
Small organic molecule
Emp. Form.:
C23H25ClFN5O3
Mol. Mass.:
473.928
SMILES:
CC(C)Cc1cc(nc(C)n1)-c1nc(no1)-c1cc(F)c(O[C@@H]2CCC(=O)N(C)C2)cc1Cl
: