Target
Transient receptor potential cation channel subfamily A member 1
Ligand
BDBM50136628
Substrate
Meas. Tech.
ChEMBL_1548564 (CHEMBL3757221)
IC50
380±n/a nM
Citation
 Verma, VAShore, DGChen, HChen, JDo, SHackos, DHKolesnikov, ALyssikatos, JPTay, SWang, LEstrada, AA a-Aryl pyrrolidine sulfonamides as TRPA1 antagonists. Bioorg Med Chem Lett 26:495-8 (2016)  
Target
Name:
Transient receptor potential cation channel subfamily A member 1
Synonyms:
ANKTM1 TRPA1 Transformation-sensitive protein p120 | Transient receptor potential cation channel subfamily A member 1 (TRPA1)
Type:
Protein
Mol. Mass.:
127514.20
Organism:
Homo sapiens (Human)
Description:
O75762
Residue:
1119
  
Inhibitor
Name:
BDBM50136628
Synonyms:
CHEMBL3752895
Type:
Small organic molecule
Emp. Form.:
C18H18F3NO2S
Mol. Mass.:
369.401
SMILES:
Cc1cc(cc(C)c1F)S(=O)(=O)N1C[C@H](F)C[C@@H]1c1ccc(F)cc1
: