Target
Poly [ADP-ribose] polymerase 2
Ligand
BDBM50136755
Substrate
Meas. Tech.
ChEMBL_1548582 (CHEMBL3757401)
IC50
>100000±n/a nM
Citation
 Haikarainen, TWaaler, JIgnatev, ANkizinkiko, YVenkannagari, HObaji, EKrauss, SLehtiö, L Development and structural analysis of adenosine site binding tankyrase inhibitors. Bioorg Med Chem Lett 26:328-33 (2016)  
Target
Name:
Poly [ADP-ribose] polymerase 2
Synonyms:
(ARTD2 or PARP2) ADPRTL2 PARP2_HUMAN Poly [ADP-ribose] polymerase 2 (PARP2)
Type:
Enzyme
Mol. Mass.:
66225.70
Organism:
Homo sapiens (Human)
Description:
Q9UGN5
Residue:
583
  
Inhibitor
Name:
BDBM50136755
Synonyms:
CHEMBL3752386
Type:
Small organic molecule
Emp. Form.:
C25H25ClN2O5
Mol. Mass.:
468.929
SMILES:
COc1ccc(cc1)C1(CNC(=O)c2ccc(NC(=O)c3ccco3)cc2Cl)CCOCC1
: