Target
Protein mono-ADP-ribosyltransferase PARP15
Ligand
BDBM50136755
Substrate
Meas. Tech.
ChEMBL_1548585 (CHEMBL3757404)
IC50
>10000±n/a nM
Citation
 Haikarainen, TWaaler, JIgnatev, ANkizinkiko, YVenkannagari, HObaji, EKrauss, SLehtiö, L Development and structural analysis of adenosine site binding tankyrase inhibitors. Bioorg Med Chem Lett 26:328-33 (2016)  
Target
Name:
Protein mono-ADP-ribosyltransferase PARP15
Synonyms:
(ARTD7 or PARP15) 2.4.2.- ADP-ribosyltransferase diphtheria toxin-like 7 B-aggressive lymphoma protein 3 Human diphtheria toxin-like ADP-ribosyltransferase (ARTD7 or PARP15, Y598L) PARP-15 Poly [ADP-ribose] polymerase 15 | Synonyms=BAL3
Type:
Mol. Mass.:
74595.89
Organism:
Homo sapiens (Human)
Description:
Q460N3
Residue:
678
  
Inhibitor
Name:
BDBM50136755
Synonyms:
CHEMBL3752386
Type:
Small organic molecule
Emp. Form.:
C25H25ClN2O5
Mol. Mass.:
468.929
SMILES:
COc1ccc(cc1)C1(CNC(=O)c2ccc(NC(=O)c3ccco3)cc2Cl)CCOCC1
: