Target
Prostaglandin E2 receptor EP3 subtype
Ligand
BDBM50138102
Substrate
Meas. Tech.
ChEMBL_1549762 (CHEMBL3757318)
EC50
8.4±n/a nM
Citation
 Kinoshita, AHigashino, MAratani, YKakuuchi, AMatsuya, HOhmoto, K Discovery of highly potent dual EP(2) and EP(3) agonists with subtype selectivity. Bioorg Med Chem Lett 26:1016-9 (2016)  
Target
Name:
Prostaglandin E2 receptor EP3 subtype
Synonyms:
PE2R3_HUMAN PGE2-R Prostaglandin E2 receptor Prostaglandin E2 receptor EP3 subtype (EP3) Prostaglandin E2 receptor EP3D subtype (EP3D) | Prostanoid EP3 receptor
Type:
Enzyme
Mol. Mass.:
43335.03
Organism:
Homo sapiens (Human)
Description:
P43115
Residue:
390
  
Inhibitor
Name:
BDBM50138102
Synonyms:
CHEMBL3752377
Type:
Small organic molecule
Emp. Form.:
C20H30N2O4S2
Mol. Mass.:
426.593
SMILES:
CCCCC(C)(C)[C@H](O)\C=C\[C@H]1CCC(=O)N1CCSc1nc(cs1)C(O)=O
: