Target
Lysine-specific histone demethylase 1A
Ligand
BDBM50236898
Substrate
Meas. Tech.
ChEMBL_1552420 (CHEMBL3760820)
IC50
15700±n/a nM
Citation
 Wu, FZhou, CYao, YWei, LFeng, ZDeng, LSong, Y 3-(Piperidin-4-ylmethoxy)pyridine Containing Compounds Are Potent Inhibitors of Lysine Specific Demethylase 1. J Med Chem 59:253-63 (2016)  
Target
Name:
Lysine-specific histone demethylase 1A
Synonyms:
AOF2 Flavin-containing amine oxidase domain-containing protein 2 KDM1A KIAA0601 Lysine-specific demethylase 1 (LSD1) Lysine-specific histone demethylase 1 (LSD1)
Type:
Enzyme
Mol. Mass.:
92901.01
Organism:
Homo sapiens (Human)
Description:
O60341
Residue:
852
  
Inhibitor
Name:
BDBM50236898
Synonyms:
(1S,2R)-(+)-2-phenylcyclopropylamine TRANYLCYPROMINE trans-2-phenylcyclopropanamine | trans-2-phenylcyclopropylamine
Type:
Small organic molecule
Emp. Form.:
C9H11N
Mol. Mass.:
133.1903
SMILES:
N[C@H]1C[C@@H]1c1ccccc1
: