Target
L-lactate dehydrogenase B chain
Ligand
BDBM50066979
Substrate
Meas. Tech.
ChEMBL_1555231 (CHEMBL3768757)
Ki
19000±n/a nM
Citation
 Rani, RKumar, V Recent Update on Human Lactate Dehydrogenase Enzyme 5 (hLDH5) Inhibitors: A Promising Approach for Cancer Chemotherapy. J Med Chem 59:487-96 (2016)  
Target
Name:
L-lactate dehydrogenase B chain
Synonyms:
L-lactate dehydrogenase B LDH heart subunit LDH-H LDHB_HUMAN Renal carcinoma antigen NY-REN-46
Type:
Oxidoreductase; homotetramer
Mol. Mass.:
36635.55
Organism:
Homo sapiens (Human)
Description:
Residue:
334
  
Inhibitor
Name:
BDBM50066979
Synonyms:
2,3-Dihydroxy-6,7-dimethyl-4-propyl-naphthalene-1-carboxylic acid | CHEMBL338325
Type:
Small organic molecule
Emp. Form.:
C16H18O4
Mol. Mass.:
274.3117
SMILES:
CCCc1c(O)c(O)c(C(O)=O)c2cc(C)c(C)cc12
: