Target
Plasmepsin I
Ligand
BDBM50145186
Substrate
Meas. Tech.
ChEMBL_1553799 (CHEMBL3767014)
IC50
36000±n/a nM
Citation
 Rasina, DOtikovs, MLeitans, JRecacha, RBorysov, OVKanepe-Lapsa, IDomraceva, IPantelejevs, TTars, KBlackman, MJJaudzems, KJirgensons, A Fragment-Based Discovery of 2-Aminoquinazolin-4(3H)-ones As Novel Class Nonpeptidomimetic Inhibitors of the Plasmepsins I, II, and IV. J Med Chem 59:374-87 (2016)  
Target
Name:
Plasmepsin I
Synonyms:
PFAPG PMI Plasmepsin-1 precursor
Type:
Enzyme
Mol. Mass.:
51463.30
Organism:
Plasmodium falciparum
Description:
Residue:
452
  
Inhibitor
Name:
BDBM50145186
Synonyms:
CHEMBL3763900
Type:
Small organic molecule
Emp. Form.:
C36H37N3O2
Mol. Mass.:
543.6979
SMILES:
Nc1nc2cc(ccc2c(=O)n1C[C@@H]1CC[C@@H](O1)c1ccccc1)-c1ccc(CCCCCc2ccccc2)cc1
: