Target
Multidrug resistance-associated protein 1
Ligand
BDBM50139436
Substrate
Meas. Tech.
ChEBML_1553383
IC50
11300±n/a nM
Citation
 Obreque-Balboa, JESun, QBernhardt, GKönig, BBuschauer, A Flavonoid derivatives as selective ABCC1 modulators: Synthesis and functional characterization. Eur J Med Chem 109:124-33 (2016)  
Target
Name:
Multidrug resistance-associated protein 1
Synonyms:
7.6.2.2 ABCC1 ATP-binding cassette, sub-family C, member 1 isoform 1 LTC4 transporter MRP MRP1_HUMAN
Type:
Mol. Mass.:
171597.72
Organism:
Homo sapiens (Human)
Description:
P33527
Residue:
1531
  
Inhibitor
Name:
BDBM50139436
Synonyms:
CHEMBL3763285
Type:
Small organic molecule
Emp. Form.:
C22H22N4O5
Mol. Mass.:
422.4339
SMILES:
COc1cc(OC)c2c(c1)oc(cc2=O)N1CCN(Cc2ccc3nonc3c2)CC1
: