Target
ATP-dependent translocase ABCB1
Ligand
BDBM50075373
Substrate
Meas. Tech.
ChEBML_1553384
IC50
220±n/a nM
Citation
 Obreque-Balboa, JESun, QBernhardt, GKönig, BBuschauer, A Flavonoid derivatives as selective ABCC1 modulators: Synthesis and functional characterization. Eur J Med Chem 109:124-33 (2016)  
Target
Name:
ATP-dependent translocase ABCB1
Synonyms:
ABCB1 MDR1_HUMAN Multidrug resistance protein 1 P-glycoprotein (P-gp) PGY1
Type:
Protein
Mol. Mass.:
141503.50
Organism:
Homo sapiens (Human)
Description:
P08183
Residue:
1280
  
Inhibitor
Name:
BDBM50075373
Synonyms:
1N-{4-[2-(6,7-dimethoxy-1,2,3,4-tetrahydro-2-isoquinolinyl)ethyl]phenyl}-4,5-dimethoxy-2-(3-quinolylcarboxamido)benzamide N-(2-((4-(2-(6,7-dimethoxy-3,4-dihydroisoquinolin-2(1H)-yl)ethyl)phenyl)carbamoyl)-4,5-dimethoxyphenyl)quinoline-3-carboxamide US11739089, Compound Tariquidar
Type:
Small organic molecule
Emp. Form.:
C38H38N4O6
Mol. Mass.:
646.7315
SMILES:
COc1cc2CCN(CCc3ccc(NC(=O)c4cc(OC)c(OC)cc4NC(=O)c4cnc5ccccc5c4)cc3)Cc2cc1OC
: