Target
Broad substrate specificity ATP-binding cassette transporter ABCG2
Ligand
BDBM50139440
Substrate
Meas. Tech.
ChEBML_1553385
IC50
>100000±n/a nM
Citation
 Obreque-Balboa, JESun, QBernhardt, GKönig, BBuschauer, A Flavonoid derivatives as selective ABCC1 modulators: Synthesis and functional characterization. Eur J Med Chem 109:124-33 (2016)  
Target
Name:
Broad substrate specificity ATP-binding cassette transporter ABCG2
Synonyms:
ABCG2 ABCP ATP-binding cassette sub-family G member 2 ATP-binding cassette, sub-family G, member 2 BCRP1 CDw338 Mitoxantrone resistance-associated protein Urate exporter
Type:
Multi-pass membrane protein; monomer or homodimer; disulfide-linked
Mol. Mass.:
72329.48
Organism:
Homo sapiens (Human)
Description:
Q9UNQ0
Residue:
655
  
Inhibitor
Name:
BDBM50139440
Synonyms:
CHEMBL3763302
Type:
Small organic molecule
Emp. Form.:
C23H23N3O7
Mol. Mass.:
453.4446
SMILES:
COc1cc(OC)c2c(c1)oc(cc2=O)C(=O)N1CCN(Cc2ccc(cc2)[N+]([O-])=O)CC1
: