Target
Adenosine receptor A2a
Ligand
BDBM50139773
Substrate
Meas. Tech.
ChEBML_1553861
Ki
0.200000±n/a nM
Citation
 Zhou, GAslanian, RGallo, GKhan, TKuang, RPurakkattle, BDe Ruiz, MStamford, ATing, PWu, HWang, HXiao, DYu, TZhang, YMullins, DHodgson, R Discovery of aminoquinazoline derivatives as human A(2A) adenosine receptor antagonists. Bioorg Med Chem Lett 26:1348-54 (2016)  
Target
Name:
Adenosine receptor A2a
Synonyms:
A2A adenosine receptor (hA2A) ADENOSINE A2 ADORA2 Adenosine A2A receptor (A2AAR)
Type:
G Protein-Coupled Receptor (GPCR)
Mol. Mass.:
44716.46
Organism:
Homo sapiens (Human)
Description:
P29274
Residue:
412
  
Inhibitor
Name:
BDBM50139773
Synonyms:
CHEMBL3765379 | US10138212, Example 101
Type:
Small organic molecule
Emp. Form.:
C20H14F3N5O2
Mol. Mass.:
413.3527
SMILES:
Nc1nc(C(=O)NCc2cccc3cccnc23)c2cccc(OC(F)(F)F)c2n1
: