Target
Melatonin receptor type 1A
Ligand
BDBM50139847
Substrate
Meas. Tech.
ChEBML_1553992
Ki
2.2±n/a nM
Citation
 Couhert, ADelagrange, PCaignard, DHChartier, ASuzenet, FGuillaumet, G Synthesis of 2-arylfuro[3,2-b]pyridines: Effect of the C2-aryl group on melatoninergic activity. Eur J Med Chem 109:268-75 (2016)  
Target
Name:
Melatonin receptor type 1A
Synonyms:
MTNR1A MTR1A_HUMAN Mel1a melatonin receptor Melatonin receptor Melatonin receptor type 1 (MT1) | Melatonin receptor type 1A
Type:
Enzyme
Mol. Mass.:
39392.94
Organism:
Homo sapiens (Human)
Description:
P48039
Residue:
350
  
Inhibitor
Name:
BDBM50139847
Synonyms:
CHEMBL3764765
Type:
Small organic molecule
Emp. Form.:
C22H20N2O3
Mol. Mass.:
360.4058
SMILES:
COc1ccc2oc(c(CCNC(C)=O)c2n1)-c1ccc2ccccc2c1
: