Target
5-hydroxytryptamine receptor 6
Ligand
BDBM50140053
Substrate
Meas. Tech.
ChEMBL_1550141 (CHEMBL3756283)
Ki
74±n/a nM
Citation
 Cozzi, NVDaley, PF Receptor binding profiles and quantitative structure-affinity relationships of some 5-substituted-N,N-diallyltryptamines. Bioorg Med Chem Lett 26:959-64 (2016)  
Target
Name:
5-hydroxytryptamine receptor 6
Synonyms:
5-HT-6 5-hydroxytryptamine receptor 6 (5-HT-6) 5-hydroxytryptamine receptor 6 (5HT6) HTR6 Serotonin 6 (5-HT6) receptor | Serotonin Receptor 6
Type:
G Protein-Coupled Receptor (GPCR)
Mol. Mass.:
46968.43
Organism:
Homo sapiens (Human)
Description:
P50406
Residue:
440
  
Inhibitor
Name:
BDBM50140053
Synonyms:
CHEMBL3754496
Type:
Small organic molecule
Emp. Form.:
C16H19FN2
Mol. Mass.:
258.3339
SMILES:
Fc1ccc2[nH]cc(CCN(CC=C)CC=C)c2c1
: