Target
Beta-galactosidase
Ligand
BDBM50140062
Substrate
Meas. Tech.
ChEMBL_1550167 (CHEMBL3756508)
Ki
0.060000±n/a nM
Citation
 Fan, QHPickens, JBStriegler, SGervaise, CD Illuminating the binding interactions of galactonoamidines during the inhibition of฿-galactosidase (E. coli). Bioorg Med Chem 24:661-71 (2016)  
Target
Name:
Beta-galactosidase
Synonyms:
BGAL_ECOLX Lactase | lacZ
Type:
PROTEIN
Mol. Mass.:
116943.87
Organism:
Escherichia coli
Description:
ChEMBL_215882
Residue:
1029
  
Inhibitor
Name:
BDBM50140062
Synonyms:
CHEMBL3359672
Type:
Small organic molecule
Emp. Form.:
C14H20N2O4
Mol. Mass.:
280.3196
SMILES:
Cc1ccc(C\N=C2/N[C@H](CO)[C@H](O)[C@H](O)[C@H]2O)cc1
: