Target
Amino acid transporter
Ligand
BDBM50140125
Substrate
Meas. Tech.
ChEMBL_1547439 (CHEMBL3757558)
IC50
12700±n/a nM
Citation
 Schulte, MLKhodadadi, ABCuthbertson, MLSmith, JAManning, HC 2-Amino-4-bis(aryloxybenzyl)aminobutanoic acids: A novel scaffold for inhibition of ASCT2-mediated glutamine transport. Bioorg Med Chem Lett 26:1044-7 (2016)  
Target
Name:
Amino acid transporter
Synonyms:
Amino acid transporter | Slc1a5
Type:
PROTEIN
Mol. Mass.:
56758.53
Organism:
Rattus norvegicus
Description:
ChEMBL_109757
Residue:
539
  
Inhibitor
Name:
BDBM50140125
Synonyms:
CHEMBL3753808
Type:
Small organic molecule
Emp. Form.:
C32H32Cl2N2O4
Mol. Mass.:
579.513
SMILES:
N[C@@H](CCN(Cc1ccccc1OCc1cccc(Cl)c1)Cc1ccccc1OCc1cccc(Cl)c1)C(O)=O
: