Target
Amino acid transporter
Ligand
BDBM50140133
Substrate
Meas. Tech.
ChEMBL_1547439 (CHEMBL3757558)
IC50
8700±n/a nM
Citation
 Schulte, MLKhodadadi, ABCuthbertson, MLSmith, JAManning, HC 2-Amino-4-bis(aryloxybenzyl)aminobutanoic acids: A novel scaffold for inhibition of ASCT2-mediated glutamine transport. Bioorg Med Chem Lett 26:1044-7 (2016)  
Target
Name:
Amino acid transporter
Synonyms:
Amino acid transporter | Slc1a5
Type:
PROTEIN
Mol. Mass.:
56758.53
Organism:
Rattus norvegicus
Description:
ChEMBL_109757
Residue:
539
  
Inhibitor
Name:
BDBM50140133
Synonyms:
CHEMBL3753592
Type:
Small organic molecule
Emp. Form.:
C32H34N2O6
Mol. Mass.:
542.6222
SMILES:
COc1ccc(Oc2ccccc2CN(CC[C@H](N)C(O)=O)Cc2ccccc2Oc2ccc(OC)cc2)cc1
: