Target
Adenosine receptor A1
Ligand
BDBM50140286
Substrate
Meas. Tech.
ChEMBL_1548613 (CHEMBL3757432)
Ki
2.1±n/a nM
Citation
 Robinson, SJPetzer, JPRousseau, ALTerre'Blanche, GPetzer, ALourens, AC Carbamate substituted 2-amino-4,6-diphenylpyrimidines as adenosine receptor antagonists. Bioorg Med Chem Lett 26:734-8 (2016)  
Target
Name:
Adenosine receptor A1
Synonyms:
AA1R_RAT ADENOSINE A1 high Adenosine A1 receptor (A1) Adenosine receptors A1 | Adora1
Type:
Protein
Mol. Mass.:
36704.13
Organism:
Rattus norvegicus (rat)
Description:
Residue:
326
  
Inhibitor
Name:
BDBM50140286
Synonyms:
CHEMBL3751996
Type:
Small organic molecule
Emp. Form.:
C19H18N4O2
Mol. Mass.:
334.3718
SMILES:
CN(C)C(=O)Oc1cccc(c1)-c1cc(nc(N)n1)-c1ccccc1
: