Target
Lysine-specific demethylase 6B
Ligand
BDBM50140574
Substrate
Meas. Tech.
ChEMBL_1548620 (CHEMBL3757620)
IC50
150±n/a nM
Citation
 Hu, JWang, XChen, LHuang, MTang, WZuo, JLiu, YCShi, ZLiu, RShen, JXiong, B Design and discovery of new pyrimidine coupled nitrogen aromatic rings as chelating groups of JMJD3 inhibitors. Bioorg Med Chem Lett 26:721-5 (2016)  
Target
Name:
Lysine-specific demethylase 6B
Synonyms:
JMJD3 Jumonji domain-containing protein 3 KDM6B_HUMAN Lysine demethylase 6B Lysine-specific demethylase 6B (KDM6B(JMJD3)) | Lysine-specific demethylase 6B (KDM6B)
Type:
Protein
Mol. Mass.:
176672.55
Organism:
Homo sapiens (Human)
Description:
O15054
Residue:
1643
  
Inhibitor
Name:
BDBM50140574
Synonyms:
CHEMBL3753391
Type:
Small organic molecule
Emp. Form.:
C20H22N6O2
Mol. Mass.:
378.4277
SMILES:
OC(=O)CCNc1nc(cc(n1)-n1cccn1)N1CCc2ccccc2CC1
: