Target
Epidermal growth factor receptor
Ligand
BDBM50141611
Substrate
Meas. Tech.
ChEMBL_1551285 (CHEMBL3762136)
Ki
6.5±n/a nM
Citation
 Hanan, EJBaumgardner, MBryan, MCChen, YEigenbrot, CFan, PGu, XHLa, HMalek, SPurkey, HESchaefer, GSchmidt, SSideris, SYen, IYu, CHeffron, TP 4-Aminoindazolyl-dihydrofuro[3,4-d]pyrimidines as non-covalent inhibitors of mutant epidermal growth factor receptor tyrosine kinase. Bioorg Med Chem Lett 26:534-9 (2016)  
Target
Name:
Epidermal growth factor receptor
Synonyms:
EGF Receptor Substrate EGFR_HUMAN ERBB1 Epidermal Growth Factor Receptor erbB-1 Epidermal growth factor receptor (EGFR) HER1 Proto-oncogene c-ErbB-1 Tyrosine-Protein Kinase ErbB-1
Type:
Receptor Kinase Domain
Mol. Mass.:
134279.59
Organism:
Homo sapiens (Human)
Description:
P00533
Residue:
1210
  
Inhibitor
Name:
BDBM50141611
Synonyms:
CHEMBL3758739
Type:
Small organic molecule
Emp. Form.:
C19H16ClF2N7O
Mol. Mass.:
431.826
SMILES:
CC1(C)OCc2c1nc(nc2Nc1n[nH]c2c(Cl)cccc12)-c1cn[nH]c1C(F)F
: