Target
Prostaglandin E synthase
Ligand
BDBM50142260
Substrate
Meas. Tech.
ChEMBL_1552424 (CHEMBL3761675)
IC50
10500±n/a nM
Citation
 Schiffler, MAAntonysamy, SBhattachar, SNCampanale, KMChandrasekhar, SCondon, BDesai, PVFisher, MJGroshong, CHarvey, AHickey, MJHughes, NEJones, SAKim, EJKuklish, SLLuz, JGNorman, BHRathmell, RERizzo, JRSeng, TWThibodeaux, SJWoods, TAYork, JSYu, XP Discovery and Characterization of 2-Acylaminoimidazole Microsomal Prostaglandin E Synthase-1 Inhibitors. J Med Chem 59:194-205 (2016)  
Target
Name:
Prostaglandin E synthase
Synonyms:
MGST1L1 PGES PTGES Prostaglandin E synthase (PGES-1) Prostaglandin E synthase-1 (PGES-1) Prostaglandin E2 synthase-1 ( mPGES-1)
Type:
Protein
Mol. Mass.:
17112.22
Organism:
Homo sapiens (Human)
Description:
Residue:
152
  
Inhibitor
Name:
BDBM50142260
Synonyms:
CHEMBL3760032
Type:
Small organic molecule
Emp. Form.:
C17H20F2N4O2
Mol. Mass.:
350.3631
SMILES:
CC[C@H](C)C(=O)NCc1ccc(C(F)F)c(c1)C(=O)Nc1ncc[nH]1
: