Target
Prostaglandin E synthase
Ligand
BDBM50142263
Substrate
Meas. Tech.
ChEMBL_1552424 (CHEMBL3761675)
IC50
2430±n/a nM
Citation
 Schiffler, MAAntonysamy, SBhattachar, SNCampanale, KMChandrasekhar, SCondon, BDesai, PVFisher, MJGroshong, CHarvey, AHickey, MJHughes, NEJones, SAKim, EJKuklish, SLLuz, JGNorman, BHRathmell, RERizzo, JRSeng, TWThibodeaux, SJWoods, TAYork, JSYu, XP Discovery and Characterization of 2-Acylaminoimidazole Microsomal Prostaglandin E Synthase-1 Inhibitors. J Med Chem 59:194-205 (2016)  
Target
Name:
Prostaglandin E synthase
Synonyms:
MGST1L1 PGES PTGES Prostaglandin E synthase (PGES-1) Prostaglandin E synthase-1 (PGES-1) Prostaglandin E2 synthase-1 ( mPGES-1)
Type:
Protein
Mol. Mass.:
17112.22
Organism:
Homo sapiens (Human)
Description:
Residue:
152
  
Inhibitor
Name:
BDBM50142263
Synonyms:
CHEMBL3759709
Type:
Small organic molecule
Emp. Form.:
C17H22N4O2
Mol. Mass.:
314.3822
SMILES:
Cc1ccc(CNC(=O)C(C)(C)C)cc1C(=O)Nc1ncc[nH]1
: