Target
Prostaglandin E synthase
Ligand
BDBM50142252
Substrate
Meas. Tech.
ChEMBL_1552422 (CHEMBL3761673)
IC50
<3.0±n/a nM
Citation
 Schiffler, MAAntonysamy, SBhattachar, SNCampanale, KMChandrasekhar, SCondon, BDesai, PVFisher, MJGroshong, CHarvey, AHickey, MJHughes, NEJones, SAKim, EJKuklish, SLLuz, JGNorman, BHRathmell, RERizzo, JRSeng, TWThibodeaux, SJWoods, TAYork, JSYu, XP Discovery and Characterization of 2-Acylaminoimidazole Microsomal Prostaglandin E Synthase-1 Inhibitors. J Med Chem 59:194-205 (2016)  
Target
Name:
Prostaglandin E synthase
Synonyms:
MGST1L1 PGES PTGES Prostaglandin E synthase (PGES-1) Prostaglandin E synthase-1 (PGES-1) Prostaglandin E2 synthase-1 ( mPGES-1)
Type:
Protein
Mol. Mass.:
17112.22
Organism:
Homo sapiens (Human)
Description:
Residue:
152
  
Inhibitor
Name:
BDBM50142252
Synonyms:
CHEMBL3758953
Type:
Small organic molecule
Emp. Form.:
C22H21ClF2N4O2
Mol. Mass.:
446.878
SMILES:
CC(C)C(=O)NCc1ccc(C(F)F)c(c1)C(=O)Nc1ncc([nH]1)-c1ccc(Cl)cc1
: