Target
Cytochrome P450 1A2
Ligand
BDBM50142266
Substrate
Meas. Tech.
ChEMBL_1552456 (CHEMBL3761707)
IC50
>30000±n/a nM
Citation
 Ruminski, PGMassa, MStrohbach, JHanau, CESchmidt, MScholten, JAFletcher, TRHamper, BCCarroll, JNShieh, HSCaspers, NCollins, BGrapperhaus, MPalmquist, KECollins, JBaldus, JEHitchcock, JKleine, HPRogers, MDMcDonald, JMunie, GEMessing, DMPortolan, SWhiteley, LOSunyer, TSchnute, ME Discovery of N-(4-Fluoro-3-methoxybenzyl)-6-(2-(((2S,5R)-5-(hydroxymethyl)-1,4-dioxan-2-yl)methyl)-2H-tetrazol-5-yl)-2-methylpyrimidine-4-carboxamide. A Highly Selective and Orally Bioavailable Matrix Metalloproteinase-13 Inhibitor for the Potential Treatment of Osteoarthritis. J Med Chem 59:313-27 (2016)  
Target
Name:
Cytochrome P450 1A2
Synonyms:
CP1A2_HUMAN CYPIA2 Cytochrome P(3)450 Cytochrome P450 1A2 (CYP1A2) Cytochrome P450-P3
Type:
Enzyme
Mol. Mass.:
58423.38
Organism:
Homo sapiens (Human)
Description:
P05177
Residue:
516
  
Inhibitor
Name:
BDBM50142266
Synonyms:
CHEMBL3759468
Type:
Small organic molecule
Emp. Form.:
C21H24FN7O5
Mol. Mass.:
473.4576
SMILES:
COc1cc(CNC(=O)c2cc(nc(C)n2)-c2nnn(C[C@H]3CO[C@H](CO)CO3)n2)ccc1F
: