Target
Carbonic anhydrase 12
Ligand
BDBM16417
Substrate
Meas. Tech.
ChEMBL_1551383 (CHEMBL3762504)
Ki
4.3±n/a nM
Citation
 Carradori, SSecci, DDe Monte, CMollica, ACeruso, MAkdemir, ASobolev, APCodispoti, RDe Cosmi, FGuglielmi, PSupuran, CT A novel library of saccharin and acesulfame derivatives as potent and selective inhibitors of carbonic anhydrase IX and XII isoforms. Bioorg Med Chem 24:1095-105 (2016)  
Target
Name:
Carbonic anhydrase 12
Synonyms:
CA-XII CAH12_HUMAN Carbonic anhydrase Carbonic anhydrase XII Carbonic anhydrase XII (CAXII) | Tumor antigen HOM-RCC-3.1.3
Type:
Enzyme
Mol. Mass.:
39456.00
Organism:
Homo sapiens (Human)
Description:
Catalytic domain of human cloned isozyme was used in the assay
Residue:
354
  
Inhibitor
Name:
BDBM16417
Synonyms:
(1,3-dioxo-1,3-dihydro-2H-isoindol-2-yl)acetic acid N-Phthaloylglycine | N-Phthalylglycine
Type:
Small organic molecule
Emp. Form.:
C10H7NO4
Mol. Mass.:
205.1669
SMILES:
OC(=O)CN1C(=O)c2ccccc2C1=O
: